{"text_format":"5","workbook":"xlsx","n_sheets":3,"sheets":["TÉR2023ért","Kitöltési útmutató","Pontok"],"props":{"creator":"Peták Ferenc","last_modified_by":"Ábrahám Hajnalka"},"not_rendered":{"defined_names":1},"read":"whole","date_system":"1900"}

{"sheet":"TÉR2023ért","index":0,"n_rows":96,"n_cols":14,"rows_kept":96,"merged":[[0,0,0,12],[1,0,1,12],[3,3,3,4],[11,0,33,0],[11,1,24,1],[11,2,21,2],[22,2,23,2],[24,2,24,4],[24,6,24,12],[25,1,32,1],[25,2,28,2],[30,2,31,2],[32,2,32,4],[32,6,32,12],[33,1,33,4],[33,6,33,12],[35,0,67,0],[35,1,51,1],[35,2,50,2],[51,2,51,4],[51,6,51,12],[52,1,59,1],[52,2,57,2],[59,2,59,4],[59,6,59,12],[60,1,66,1],[60,2,65,2],[66,2,66,4],[66,6,66,12],[67,1,67,4],[67,6,67,12],[69,0,84,0],[69,1,77,1],[69,2,76,2],[70,13,70,19],[77,2,77,4],[77,6,77,12],[78,1,83,1],[78,2,82,2],[83,2,83,4],[83,6,83,12],[84,1,84,4],[84,6,84,12],[86,0,86,4],[86,6,86,12]]}
["SZAOK TÉR PONTSZÁMOK - ELMÉLETI"]
["Értékelés: összesen max 100 pont; oktatás max 50, tudomány max 60, elismertség max 25 pont"]
[]
[null,"Oktató-kutató neve:",null,"Pontszám összefoglaló:"]
[null,"Beosztása:",null,"Oktatási teljesítmény",{"$f":"F34","v":{"v":0,"d":"0.0 pont"}}]
[null,"Szervezeti egysége:",null,"Tudományos teljesítmény",{"$f":"F68","v":{"v":0,"d":"0.0 pont"}}]
[null,"Neptun kódja:",null,"Közéleti teljesítmény",{"$f":"F85","v":{"v":0,"d":"0.0 pont"}}]
[null,"MTMT azonosítója:",null,"Összesen:",{"$f":"F87","v":{"v":0,"d":"0.0 pont"}}]
[null,"Orcid azonosító:"]
[null,"Heti munkaidő (óra):",null,"(Teljes állás: 40 óra/hét)"]
[{"$nulls":4},"Adat","Pontszám"]
["OKTATÁSI TELJESÍTMÉNY","OKTATÁS\n\nKitöltés NEPTUN \nszerint","Graduális oktatás","Előadás, óra / hét (3 év átlagában)",0,{"$f":"E12*1","v":0},"1 pont/heti 1 óra (idegen nyelvű is). Osztott előadásnál tört érték is lehet."]
[{"$nulls":3},"Szeminárium / gyakorlat, óra / hét (3 év átlagában)",0,{"$f":"E13*0.5","v":0},"0,5 pont/heti 1 óra (idegen nyelvű is)."]
[{"$nulls":3},"Megvédett szakdolgozati témavezetések száma",0,{"$f":"IF(E14>5,5,E14)","v":0},"1 pont védett szakdolgozatonként, maximum 5 p",{"$nulls":6},"Témavezetők között megosztott pontszám"]
[{"$nulls":3},"Osztályfőnök","Nem",{"$f":"IF(E15=\"Igen\",1,0)","v":0},"0-1","igen/nem"]
[{"$nulls":3},"Tanulmányi felelős (nyelvenként, karonként)",0,{"$f":"VLOOKUP(E16,Pontok!T1:U4,2,TRUE)","v":0},"0-5","Nyelvenként egy: 3p, kettő: 4p, három és felette: 5p"]
[{"$nulls":3},"Tantárgyfelelős (tárgyak száma)",0,{"$f":"VLOOKUP(E17,Pontok!W1:X7,2,1)","v":0},"0-3","1p: 1-2 tárgy, 2p: 3-5 tárgy, 3p: >5 tárgy"]
[{"$nulls":3},"Egyéb felelősség (MTMT felelős, állatetika felelős, kábítószerfelelős, leltárfelelős, stb)","Nem",{"$f":"IF(E18=\"Igen\",1,0)","v":0},"0-1","igen/nem",{"$nulls":5},"Csak kutatással vagy oktatással kapcsolatos egyéb felelősség vehető figyelembe"]
[{"$nulls":3},"Vizsgáztatás (kollokvium, szigorlat) - Tanszékvezető tölti ki!",0,{"$f":"E19","v":0},"0-6","Terhelés mértékéről a tanszékvezető nyilatkozik",{"$nulls":5},"Tanszékvezető megítélése szerint milyen mértékben segítette a vizsgák lebonyolítását (nem féltétlen a vizsgázók száma, tesztelőkészítés, adminisztráció, vizsgafelügyelet)"]
[{"$nulls":3},"Tankönyv/jegyzet készítés","Nem",{"$f":"IF(E20=\"Igen\",3,0)","v":0},"0-3","igen/nem",{"$nulls":5},"Részvétel az oktatáshoz kapcsolódó papír alapú vagy elektronikus tankönyv/jegyzet/segédanyag írásában/szerkesztésében."]
[{"$nulls":3},"Oktatásszervezés","Nem",{"$f":"IF(E21=\"Igen\",3,0)","v":0},"0-3","igen/nem",{"$nulls":5},"Tanszéki szintű oktatásszervezési feladatokban részvétel (nem csak saját feladatok elvégzése). Pl. órarendkészítés, terembeosztás, oktatási rendszerek kezelése."]
[{"$nulls":3},"Egyéb oktatásfejlesztés/szervezés","Nem",{"$f":"IF(E22=\"Igen\",3,0)","v":0},"0-3","igen/nem",{"$nulls":5},"Új kurzus indítása, új oktatási eszköz vagy módszer fejlesztése, jó gyakorlatok megismertetése"]
[null,null,"Egyéb oktatás","Posztgraduális oktatás (rezidens képzés, szakképzés, PhD képzés - 3 év átlagában)",0,{"$f":"E23","v":0},"1 pont/heti oktatott óra (gyakorlat, előadás, idegen nyelvű oktatás).",{"$nulls":6},"Aggregált mutató: rezidens, szakképzés, PhD kurzusok."]
[{"$nulls":3},"Egyéb extrakurrikuláris oktatás (nyári egyetem, kutatók éjszakája, népszerűsítés, nyílt nap - 1 év)","Nem",{"$f":"IF(E24=\"Igen\",1,0)","v":0},"0-1","igen/nem"]
[null,null,"OKTATÁS ÖSSZESEN",null,null,{"$f":"SUM(F12:F24)","v":0},"Ennek a részeredménynek nincs felső határa, de az Oktatás összpontszáma nem lépheti túl az 50 pontot (lásd 31. sor)"]
[null,"TEHETSÉGGONDOZÁS\n\nNEPTUN ill. Doktori Iskola adatbázisa alapján","TDK hallgatók","Dokumentálható TDK aktivitás (pl. közlemény, konferencia, pályamunka) (db)",0,{"$f":"VLOOKUP(E26,Pontok!$A$1:$B$31,2,1)","v":0},"0-2","0p: =0","0,5p: =0,5","1p: =1-2","2p: >2",null,null,"TDK konferencia esetén a témavezetők között megosztott pontszám. Közlemény, vagy egyéb konferencia esetén az első és utolsó szerző között megosztott pontszám."]
[{"$nulls":3},"Díjazott helyi TDK konferencia előadás (I., II., III. , Különdíj) (db)",0,{"$f":"E27","v":0},"Minden díjazott előadás 1p",{"$nulls":6},"TDK konferencián a témavezetők között megosztott pontszám. "]
[{"$nulls":3},"OTDK díjazott  előadás (I., II., III. , Különdíj) (db)",0,{"$f":"E28","v":0},"Minden díjazott előadás 1p",{"$nulls":6},"OTDK-n a témavezetők között megosztott pontszám. "]
[{"$nulls":3},"TDK pályamunka bírálat",0,{"$f":"VLOOKUP(E29,Pontok!D1:E2,2,1)","v":0},"0-1","0p: =0","1p: ≥1"]
[null,null,"Demonstrátori tevékenység","Foglalkoztatott demonstrátorok (fő)",0,{"$f":"VLOOKUP(E30,Pontok!D1:E2,2,1)","v":0},"0-1","0p: =0","1p: ≥1"]
[null,null,"PhD hallgatók","Beiratkozott (doktori.hu) (fő)",0,{"$f":"VLOOKUP(E31,Pontok!G1:H5,2,1)","v":0},"0-4","0p: =0","0,5p: =0,5","1p: =1","1.5p: =1.5","2p: ≥2",null,"PhD témavezetők között megosztott pontszám"]
[{"$nulls":3},"Ebből fokozatot szerzett (fő)",0,{"$f":"E32*5","v":0},"0-","Fokozatot szerző hallgató(k) száma x5",{"$nulls":5},"PhD témavezetők között megosztott pontszám"]
[null,null,"UTÁNPÓTLÁSNEVELÉS ÖSSZESEN",null,null,{"$f":"SUM(F26:F32)","v":0},"Ennek a részeredménynek nincs felső határa, de az Oktatás összpontszáma nem lépheti túl az 50 pontot (lásd 31. sor)"]
[null,"OKTATÁSI TELJESÍTMÉNY ÖSSZESEN (MAXIMUM 50 PONT)",{"$nulls":3},{"$f":"IF((F25+F33)>50,50,F25+F33)","v":0}]
[{"$nulls":9},"Súlyfaktorok"]
["TUDOMÁNYOS TELJESÍTMÉNY","PUBLIKÁCIÓS TEVÉKENYSÉG \n\nMTMT adatbázis alapján","Közlemények\n\n1 tétel csak 1 helyre számolható el!","Első/utolsó/levelező szerzős nagy impaktú publikációk (10 impakt faktor feletti)",0,{"$f":"E36*15","v":0},"15p/db"]
[{"$nulls":3},"Társszerzős nagy impaktú publikációk (10 impakt faktor feletti)",0,{"$f":"E37*7.5","v":0},"7.5p/db"]
[{"$nulls":3},"Első/utolsó/levelező szerzős D1 publikációk",0,{"$f":"E38*5","v":0},"5p/db"]
[{"$nulls":3},"Társszerzős D1 publikációk",0,{"$f":"E39*2.5","v":0},"2.5p/db"]
[{"$nulls":3},"Első/utolsó/levelező szerzős Q1 publikációk",0,{"$f":"E40*4","v":0},"4p/db"]
[{"$nulls":3},"Társszerzős Q1 publikációk",0,{"$f":"E41*2","v":0},"2p/db"]
[{"$nulls":3},"Első/utolsó/levelező szerzős Q2 publikációk",0,{"$f":"E42*2.5","v":0},"2.5p/db"]
[{"$nulls":3},"Társszerzős Q2 publikációk",0,{"$f":"E43*1","v":0},"1p/db"]
[{"$nulls":3},"Első/utolsó/levelező szerzős Q3/Q4 publikációk",0,{"$f":"E44*1","v":0},"1p/db"]
[{"$nulls":3},"Társszerzős Q3/Q4 publikációk",0,{"$f":"E45*0.5","v":0},"0.5p/db"]
[{"$nulls":3},"Összes közlemények (in extensio)",0,{"$f":"VLOOKUP(E46,Pontok!AQ:AR,2,TRUE)","v":0},"0-3","0:≤4","1:≤6","2:<10","3:≥10",null,null,"Az MTMT-ben teljes tudományos besorolású, fentebb nem elszámolt folyóiratcikkek, Konferenciaközlemény és Recenzió/kritika kivételével."]
[{"$nulls":3},"Besorolás \"scientometrics.org\" alapján","D4-D10",{"$f":"VLOOKUP(E47,Pontok!AT1:AU4,2,FALSE)","v":0},"3p: D1, 2p: D2, 1p:D3, 0p:D4-D10",{"$nulls":6},"Nem MTMT alapján, egyénileg kitöltendő."]
[{"$nulls":3},"Teljes könyv",0,{"$f":"E48*15","v":0},"15p/db",{"$nulls":6},"Az MTMT-ben szakkönyv besorolású könyv. A felsőoktatási tankönyvek az Oktatási teljesítmény részben számolhatók el."]
[{"$nulls":3},"Könyvszerkesztés",0,{"$f":"E49*4","v":0},"4p/db",{"$nulls":6},"Az MTMT-ben szakkönyv vagy tanulmánykötet besorolású könyv szerkesztése."]
[{"$nulls":3},"Első/utolsó szerzős könyvfejezet",0,{"$f":"E50*2","v":0},"2p/db",{"$nulls":6},"Az MTMT-ben könyvfejezet vagy szaktanulmány besorolású könyvrészlet. A felsőoktatási tankönyvek részei az Oktatási teljesítmény részben számolhatók el."]
[{"$nulls":3},"Társszerzős könyvfejezet",0,{"$f":"E51","v":0},"1p/db",{"$nulls":6},"Az MTMT-ben könyvfejezet vagy szaktanulmány besorolású könyvrészlet. A felsőoktatási tankönyvek részei az Oktatási teljesítmény részben számolhatók el."]
[null,null,"PUBLIKÁCIÓS TEVÉKENYSÉG ÖSSZESEN",null,null,{"$f":"SUM(F36:F51)","v":0},"Ennek a részeredménynek nincs felső határa, de a Tudományos összpontszám nem lépheti túl az 60 pontot (lásd 67. sor)"]
[null,"ÉLETMŰ\n\nMTMT adatbázis alapján valamint oklevelek csatolása","Tudományos teljesítmény életműre vonatkozó adatai","Független citáció a teljes életműre",0,{"$f":"LN(E53/20+1)","v":{"v":0,"d":"0.0 pont"}},"ln(összes idézettség/20+1)",{"$nulls":6},"Az MTMT összefoglaló táblázatában szereplő összes független citáció darabszáma."]
[{"$nulls":3},"Hirsch index ",0,{"$f":"E54/10","v":0},"Hirsch index / 10",{"$nulls":6},"Az MTMT összefoglaló táblázatában szereplő Hirsch index."]
[{"$nulls":3},"PhD","Nem",{"$f":"IF(E55=\"Igen\",2,0)","v":0},"0/2","igen/nem"]
[{"$nulls":3},"Habilitáció ","Nem",{"$f":"IF(E56=\"Igen\",2,0)","v":0},"0/2","igen/nem"]
[{"$nulls":3},"MTA Doktori fokozat","Nem",{"$f":"IF(E57=\"Igen\",4,0)","v":0},"0/4","igen/nem"]
[{"$nulls":3},"MTA tagság (csak rendes vagy levelező tagság)","Nem",{"$f":"IF(E58=\"Igen\",5,0)","v":0},"0/5","igen/nem","Köztestületi tagság nem értékelhető!"]
[null,null,"Szabadalom","Nemzetközi szabadalmak száma (megítélt/befogadott)",0,{"$f":"E59*1","v":0},"1p / szabadalom"]
[null,null,"ÉLETMŰ ÖSSZESEN",null,null,{"$f":"SUM(F53:F59)","v":{"v":0,"d":"0.0 pont"}},"Ennek a részeredménynek nincs felső határa, de a Tudományos összpontszám nem lépheti túl az 60 pontot (lásd 67. sor)"]
{"$rows_left_out":37}
{"sheet":"Kitöltési útmutató","index":1,"n_rows":85,"n_cols":6,"rows_kept":85,"merged":[[11,0,33,0],[11,1,24,1],[11,2,21,2],[22,2,23,2],[24,2,24,4],[25,1,32,1],[25,2,28,2],[30,2,31,2],[32,2,32,4],[33,1,33,4],[35,0,67,0],[35,1,51,1],[35,2,50,2],[51,2,51,4],[52,1,59,1],[52,2,57,2],[59,2,59,4],[60,1,66,1],[60,2,65,2],[66,2,66,4],[67,1,67,4],[69,0,84,0],[69,1,77,1],[69,2,76,2],[77,2,77,4],[78,1,83,1],[78,2,82,2],[83,2,83,4],[84,1,84,4]]}
{"$rows_empty":10}
[{"$nulls":4},"Időintervallum","Egyéb szempont"]
["OKTATÁSI TELJESÍTMÉNY","OKTATÁS\n\nKitöltés NEPTUN \nszerint","Graduális oktatás","Előadás, óra / hét (3 év átlagában)","Az adatokat az elmúlt 3 évben (2021-2023) oktatott órák alapján kell megadni a Kari Tanulmányi ügyrendben foglaltak alapján (1 óra=45 perc, egy szemeszter 14 hét)","Vonatkozó rendelkezés a SZEGEDI TUDOMÁNYEGYETEM Szent-Györgyi Albert Orvostudományi Kar Kari Tanulmányi Ügyrendjének 5. pontja:  A TANULMÁNYOK IDŐBEOSZTÁSA (SZTE TVSZ 5.1.) 5.1. A tanév két félévből (szemeszterből) áll. A félévek szorgalmi időszakból és vizsgaidőszakból állnak.  A szorgalmi időszak legalább 14 hét, a vizsgaidőszak 6+1 hét, ahol a 7. hét az utóvizsga-időszak. A vizsgaidőszakon belül a vizsganapokat a tanszékek határozzák meg. A tanórák az egyetemen 45 percesek. http://www.med.u-szeged.hu/karunkrol/kari-szabalyzatok/ktu-2022-12-13-kt"]
[{"$nulls":3},"Szeminárium / gyakorlat, óra / hét (3 év átlagában)","Az adatokat az elmúlt 3 évben (2021-2023) oktatott órák alapján kell megadni a Kari Tanulmányi ügyrendben foglaltak alapján (1 óra=45 perc, egy szemeszter 14 hét)","Vonatkozó rendelkezés a SZEGEDI TUDOMÁNYEGYETEM Szent-Györgyi Albert Orvostudományi Kar Kari Tanulmányi Ügyrendjének 5. pontja:  A TANULMÁNYOK IDŐBEOSZTÁSA (SZTE TVSZ 5.1.) 5.1. A tanév két félévből (szemeszterből) áll. A félévek szorgalmi időszakból és vizsgaidőszakból állnak.  A szorgalmi időszak legalább 14 hét, a vizsgaidőszak 6+1 hét, ahol a 7. hét az utóvizsga-időszak. A vizsgaidőszakon belül a vizsganapokat a tanszékek határozzák meg. A tanórák az egyetemen 45 percesek. http://www.med.u-szeged.hu/karunkrol/kari-szabalyzatok/ktu-2022-12-13-kt"]
[{"$nulls":3},"Megvédett szakdolgozati témavezetések száma","Az adatokat az elmúlt 3 év (2021-2023) kummulatív adatai alapján kérjük megadni","Osztott témavezetésnél a pontszámot osztani kell"]
[{"$nulls":3},"Osztályfőnök","Az adatokat az elmúlt 3 év (2021-2023) kummulatív adatai alapján kérjük megadni"]
[{"$nulls":3},"Tanulmányi felelős (nyelvenként, karonként)","Az adatokat az elmúlt 3 év (2021-2023) kummulatív adatai alapján kérjük megadni"]
[{"$nulls":3},"Tantárgyfelelős (tárgyak száma)","Az adatokat az elmúlt 3 év (2021-2023) kummulatív adatai alapján kérjük megadni"]
[{"$nulls":3},"Egyéb felelősség (MTMT felelős, állatetika felelős, kábítószerfelelős, leltárfelelős, stb)","Az adatokat az elmúlt 3 év (2021-2023) kummulatív adatai alapján kérjük megadni"]
[{"$nulls":3},"Vizsgáztatás (kollokvium, szigorlat)","Az adatokat az elmúlt 3 év (2021-2023) kummulatív adatai alapján kérjük megadni","A terhelés mértékéről a tanszékvezető nyilatkozik"]
[{"$nulls":3},"Tankönyv/jegyzet készítés","Az adatokat az elmúlt 3 év (2021-2023) kummulatív adatai alapján kérjük megadni"]
[{"$nulls":3},"Oktatásszervezés","Az adatokat az elmúlt 3 év (2021-2023) kummulatív adatai alapján kérjük megadni"]
[{"$nulls":3},"Egyéb oktatásfejlesztés/szervezés","Az adatokat az elmúlt 3 év (2021-2023) kummulatív adatai alapján kérjük megadni"]
[null,null,"Egyéb oktatás","Posztgraduális oktatás (rezidens képzés, szakképzés, PhD képzés)","Az adatokat az elmúlt 3 évben (2021-2023) oktatott órák alapján kell megadni a Kari Tanulmányi ügyrendben foglaltak alapján (1 óra=45 perc, egy szemeszter 14 hét)"]
[{"$nulls":3},"Egyéb extrakurrikuláris oktatás (nyári egyetem, kutatók éjszakája, népszerűsítés, nyílt nap)","Az adatokat az elmúlt 1 év (2023) adatai alapján kérjük megadni"]
[null,null,"OKTATÁS ÖSSZESEN"]
[null,"TEHETSÉGGONDOZÁS\n\nNEPTUN ill. Doktori Iskola adatbázisa alapján","TDK hallgatók","Dokumentálható TDK aktivitás (pl. közlemény, konferencia, pályamunka) (db)","Az adatokat az elmúlt 3 év (2021-2023) kummulatív adatai alapján kérjük megadni"]
[{"$nulls":3},"Díjazott helyi TDK konferencia előadás (I., II., III. , Különdíj) (db)","Az adatokat az elmúlt 3 év (2021-2023) kummulatív adatai alapján kérjük megadni"]
[{"$nulls":3},"OTDK díjazott  előadás (I., II., III. , Különdíj) (db)","Az adatokat az elmúlt 3 év (2021-2023) kummulatív adatai alapján kérjük megadni"]
[{"$nulls":3},"TDK pályamunka bírálat","Az adatokat az elmúlt 3 év (2021-2023) kummulatív adatai alapján kérjük megadni"]
[null,null,"Demonstrátori tevékenység","Foglalkoztatott demonstrátorok (fő)","Az adatokat az elmúlt 3 év (2021-2023) kummulatív adatai alapján kérjük megadni"]
[null,null,"PhD hallgatók","Beiratkozott (doktori.hu) (fő)","Az adatokat az elmúlt 3 év (2021-2023) kummulatív adatai alapján kérjük megadni"]
[{"$nulls":3},"Ebből fokozatot szerzett (fő)","Az adatokat az elmúlt 3 év (2021-2023) kummulatív adatai alapján kérjük megadni"]
[null,null,"UTÁNPÓTLÁSNEVELÉS ÖSSZESEN"]
[null,"OKTATÁSI TELJESÍTMÉNY ÖSSZESEN (MAXIMUM 50 PONT)"]
[]
["TUDOMÁNYOS TELJESÍTMÉNY","PUBLIKÁCIÓS TEVÉKENYSÉG \n\nMTMT adatbázis alapján","Közlemények\n\n1 tétel csak 1 helyre számolható el!","Első/utolsó/levelező szerzős nagy impaktú publikációk (10 impakt faktor feletti)","Az adatokat az elmúlt 3 év (2021-2023) kummulatív adatai alapján kérjük megadni"]
[{"$nulls":3},"Társszerzős nagy impaktú publikációk (10 impakt faktor feletti)","Az adatokat az elmúlt 3 év (2021-2023) kummulatív adatai alapján kérjük megadni","A publikáció csak abban az esetben számolható el, ha a szerző nevesítve van, a konzorciumok, study group-ok nem nevesített tagjaként jegyzett cikkek nem számolhatóak el"]
[{"$nulls":3},"Első/utolsó/levelező szerzős D1 publikációk","Az adatokat az elmúlt 3 év (2021-2023) kummulatív adatai alapján kérjük megadni"]
[{"$nulls":3},"Társszerzős D1 publikációk","Az adatokat az elmúlt 3 év (2021-2023) kummulatív adatai alapján kérjük megadni","A publikáció csak abban az esetben számolható el, ha a szerző nevesítve van, a konzorciumok, study group-ok nem nevesített tagjaként jegyzett cikkek nem számolhatóak el"]
[{"$nulls":3},"Első/utolsó/levelező szerzős Q1 publikációk","Az adatokat az elmúlt 3 év (2021-2023) kummulatív adatai alapján kérjük megadni"]
[{"$nulls":3},"Társszerzős Q1 publikációk","Az adatokat az elmúlt 3 év (2021-2023) kummulatív adatai alapján kérjük megadni","A publikáció csak abban az esetben számolható el, ha a szerző nevesítve van, a konzorciumok, study group-ok nem nevesített tagjaként jegyzett cikkek nem számolhatóak el"]
[{"$nulls":3},"Első/utolsó/levelező szerzős Q2 publikációk","Az adatokat az elmúlt 3 év (2021-2023) kummulatív adatai alapján kérjük megadni"]
[{"$nulls":3},"Társszerzős Q2 publikációk","Az adatokat az elmúlt 3 év (2021-2023) kummulatív adatai alapján kérjük megadni","A publikáció csak abban az esetben számolható el, ha a szerző nevesítve van, a konzorciumok, study group-ok nem nevesített tagjaként jegyzett cikkek nem számolhatóak el"]
[{"$nulls":3},"Első/utolsó/levelező szerzős Q3/Q4 publikációk","Az adatokat az elmúlt 3 év (2021-2023) kummulatív adatai alapján kérjük megadni"]
[{"$nulls":3},"Társszerzős Q3/Q4 publikációk","Az adatokat az elmúlt 3 év (2021-2023) kummulatív adatai alapján kérjük megadni","A publikáció csak abban az esetben számolható el, ha a szerző nevesítve van, a konzorciumok, study group-ok nem nevesített tagjaként jegyzett cikkek nem számolhatóak el"]
[{"$nulls":3},"Összes közlemények (in extensio)","Az adatokat az elmúlt 3 év (2021-2023) kummulatív adatai alapján kérjük megadni"]
[{"$nulls":3},"Besorolás \"scientometrics.org\" alapján","Az adatokat az elmúlt 3 év (2021-2023) kummulatív adatai alapján kérjük megadni"]
[{"$nulls":3},"Teljes könyv","Az adatokat az elmúlt 3 év (2021-2023) kummulatív adatai alapján kérjük megadni"]
[{"$nulls":3},"Könyvszerkesztés","Az adatokat az elmúlt 3 év (2021-2023) kummulatív adatai alapján kérjük megadni"]
[{"$nulls":3},"Első/utolsó szerzős könyvfejezet","Az adatokat az elmúlt 3 év (2021-2023) kummulatív adatai alapján kérjük megadni"]
[{"$nulls":3},"Társszerzős könyvfejezet","Az adatokat az elmúlt 3 év (2021-2023) kummulatív adatai alapján kérjük megadni"]
[null,null,"PUBLIKÁCIÓS TEVÉKENYSÉG ÖSSZESEN"]
[null,"ÉLETMŰ\n\nMTMT adatbázis alapján valamint oklevelek csatolása","Tudományos teljesítmény életműre vonatkozó adatai","Független citáció a teljes életműre","Az adatokat a teljes életmű alapján kérjük megadni"]
[{"$nulls":3},"Hirsch index ","Az adatokat a teljes életmű alapján kérjük megadni"]
[{"$nulls":3},"PhD","Az adatokat a teljes életmű alapján kérjük megadni"]
[{"$nulls":3},"Habilitáció ","Az adatokat a teljes életmű alapján kérjük megadni"]
[{"$nulls":3},"MTA Doktori fokozat","Az adatokat a teljes életmű alapján kérjük megadni"]
[{"$nulls":3},"MTA tagság (csak rendes vagy levelező tagság)","Az adatokat a teljes életmű alapján kérjük megadni"]
[null,null,"Szabadalom","Nemzetközi szabadalmak száma (megítélt/befogadott)","Az adatokat a teljes életmű alapján kérjük megadni"]
[null,null,"ÉLETMŰ ÖSSZESEN"]
[null,"PÁLYAZATI TEVÉKENYSÉG","Pályázatok, ipari együttműködések","Nemzetközi elbírálású pályázatok vezetője (db)","Az adatokat az elmúlt 3 év (2021-2023) kummulatív adatai alapján kérjük megadni"]
[{"$nulls":3},"Hazai elbírálású pályázatok vezetője /operatív vezető (db)","Az adatokat az elmúlt 3 év (2021-2023) kummulatív adatai alapján kérjük megadni"]
[{"$nulls":3},"Nemzetközi elbírálású pályázatok résztvevője (db)","Az adatokat az elmúlt 3 év (2021-2023) kummulatív adatai alapján kérjük megadni"]
[{"$nulls":3},"Hazai elbírálású pályázatok résztvevője (db)","Az adatokat az elmúlt 3 év (2021-2023) kummulatív adatai alapján kérjük megadni"]
[{"$nulls":3},"Egyetemi/kari elbírálású pályázatok (db)","Az adatokat az elmúlt 3 év (2021-2023) kummulatív adatai alapján kérjük megadni"]
[{"$nulls":3},"Ipari együttműködések (KFI nyilvántartás)","Az adatokat az elmúlt 3 év (2021-2023) kummulatív adatai alapján kérjük megadni"]
[null,null,"PÁLYAZATI TEVÉKENYSÉG ÖSSZESEN"]
[null,"TUDOMÁNYOS TELJESÍTMÉNY ÖSSZESEN (MAXIMUM 60 PONT)"]
[]
{"$rows_left_out":17}
{"sheet":"Pontok","index":2,"n_rows":34,"n_cols":47,"rows_kept":34,"hidden":true}
[0,0,null,0,0,null,0,0,null,0,{"$f":"J1/2","v":0},null,"Egyetemi tanársegéd",0.5,12,null,0,0,null,0,0,null,0,0,null,"Vezető",6,null,null,0,0,null,0,0,null,0,0,null,"0:≤4","1:≤6","2:<10","3:≥10",0,0,null,"D1",3]
[0.5,0.5,null,1,1,null,0.5,0.5,null,1,{"$f":"J2/2","v":0.5},null,"Egyetemi adjunktus",{"$f":"$N$1*$O$1/O2","v":0.6},10,null,0.5,0.5,null,1,3,null,1,1,null,"Helyettes",3,null,null,1,1,null,1,1,null,1,1,{"$nulls":5},5,1,null,"D2",2]
[1,1,{"$nulls":4},1,1,null,2,1,null,"Egyetemi docens",{"$f":"$N$1*$O$1/O3","v":0.75},8,null,1,1,null,2,4,null,2,1,{"$nulls":5},2,1,null,2,2,null,2,2,{"$nulls":5},7,2,null,"D3",1]
[1.5,1,{"$nulls":4},1.5,1.5,null,3,1.5,null,"Egyetemi tanár",1,6,null,1.5,1,null,3,5,null,3,2,{"$nulls":5},3,1,{"$nulls":11},10,3,null,"D4-D10",0]
[2,1,{"$nulls":4},2,2,null,4,2,null,"Tudományos segédmunkatárs",0.5,12,null,2,1.5,{"$nulls":4},4,2,{"$nulls":5},4,2]
[2.5,2,{"$nulls":7},5,2.5,null,"Tudományos munkatárs",{"$f":"$N$1*$O$1/O6","v":0.6},10,null,2.5,1.5,{"$nulls":4},5,2]
[{"$nulls":9},6,3,null,"Tudományos főmunkatárs",{"$f":"$N$1*$O$1/O7","v":0.75},8,null,3,2,{"$nulls":4},6,3]
[{"$nulls":9},7,3.5,null,"Tudományos tanácsadó",1,6]
[{"$nulls":9},8,4,null,"Egyéb beosztás"]
[{"$nulls":9},9,4.5]
[{"$nulls":9},10,5]
[{"$nulls":9},11,5.5]
[{"$nulls":9},12,6,{"$nulls":14},"0p:=0","1p:<4","2p:≥4"]
[{"$nulls":9},13,6.5]
[{"$nulls":9},14,7]
[{"$nulls":9},15,7.5]
[{"$nulls":9},16,8,null,"1p: 1-2 tárgy, 2p: 2-5 tárgy, 3p: >5 tárgy"]
[{"$nulls":9},17,8.5]
[{"$nulls":9},18,9]
[{"$nulls":9},19,9.5]
[{"$nulls":9},20,{"$f":"J21/2","v":10}]
[{"$nulls":9},1000,10]
{"$rows_empty":11}
["Protect jelszó: alma"]